{"text_format":"1","workbook":"xlsx","n_sheets":17,"sheets":["Questions for producers (2)","Directions","Questions for Producers","Fencing","Enterprise budget","Breeding Herd","Marketing","Feed, Hay, Supplements","Animal Health","Pasture","Labor","Equipment and Facilities","Fuel and Utilities","Operating Loan and Interest","Taxes","Insurance","Assumptions"],"not_rendered":{"charts":0,"images":1,"macros":1,"external_links":0,"defined_names":0,"comments":1,"pivot_tables":0},"unopened":[],"bounds":{"document_bytes":16777216,"sheet_cells":100000,"rows_first":2000,"rows_last":500,"rows_between":2000,"halvings":0,"cell_chars":16384,"cell_head_chars":4096},"cells_cut":0,"cells_raw":0,"read":"whole","date_system":"1900"}

{"sheet":"Questions for producers (2)","index":0,"n_rows":430,"n_cols":8,"rows_kept":430,"cut":false,"hidden":true,"merged":[[0,0,0,2]]}
["There are 13 broad categories of revenue and expenses we would like to understand about your operation: "]
["Breeding herd"]
["Market animals sold "]
["Feed and hay"]
["Animal health and medical "]
["Pasture/Land/Fertilizer"]
["Fencing "]
["Equipment "]
["Fuel"]
["Labor "]
["Utilities "]
["Operating Loans"]
["Insurance"]
["Taxes"]
[null,null,null,null,null,"Interview 1 responses"]
{"$rows_left_out":416}
{"sheet":"Directions","index":1,"n_rows":0,"n_cols":0,"rows_kept":0,"cut":false,"hidden":false,"merged":[]}

{"sheet":"Questions for Producers","index":2,"n_rows":561,"n_cols":5,"rows_kept":561,"cut":false,"hidden":false,"merged":[[0,0,0,2]]}
["There are 11 broad categories of revenue and expenses we would like to understand about your enterprise: "]
["Note: Only include revenues and costs for cow-calf enterprise. If the cost or revenue is shared with another enterprise then change the allocation appropriately. "]
["Enterprise","Cow-Calf"]
["Dates","Oct 1 2017- Sept 30 2018"]
[]
["Breeding Herd",null,"Unit",null,"Notes"]
["Current breeding cows"]
["Number of breeding cows",null,"head"]
["Useful life of cow ",null,"years"]
["What percent of your cows have a calf that is sold or used as a replacement each year?"]
["What percent of your cows do you replace each year?"]
["How many cows die per year on your farm",null,"head"]
[]
["Replacement heifers/cows purchased"]
["Number of purchased replacement heifers/cows",null,"head"]
{"$rows_left_out":547}
{"sheet":"Fencing","index":3,"n_rows":29,"n_cols":11,"rows_kept":29,"cut":false,"hidden":false,"merged":[]}
[null,null,null,null,null,null,null,"Assumptions:"]
[]
[null,null,null,null,null,null,null,"Fencing Type:","Installation Cost: $/ft","Economic Life: Years","Annual Replacement"]
[null,null,null,null,null,null,null,"Woven Wire",1.93,20,0.08]
[null,null,null,null,null,null,null,"Barbed Wire",1.48,20,0.08]
[null,null,null,null,null,null,null,"High-Tensile Non-Electric",1.24,25,0.05]
[null,null,null,null,null,null,null,"High-Tensile Electric",0.89,25,0.05]
[null,null,null,null,null,null,null,"Electrified Polywire",0.04,4,0.05]
[]
[]
[]
[]
[]
["Permanent Fence:"]
["Runs:","Fence Type:","Feet:","Installation Cost: $/ft","Miles:","Installation Cost: $/mi."]
{"$rows_left_out":15}
{"sheet":"Enterprise budget","index":4,"n_rows":44,"n_cols":7,"rows_kept":44,"cut":false,"hidden":false,"merged":[]}
["Estimated returns and expenses for cow-calf operation "]
[]
["Revenue"]
[null,"Quantity","Units","Price","Units","$/cow","$/herd"]
[]
["Heifer calves",{"$f":"Marketing!B15","v":0},"lb.",{"$f":"Marketing!B17","v":0},"$/lb.",{"$f":"Marketing!B20","v":"0"},{"$f":"Marketing!B19","v":0}]
["Steer calves ",{"$f":"Marketing!B5","v":0},"lb.",{"$f":"Marketing!B7","v":0},"$/lb.",{"$f":"Marketing!B10","v":"0"},{"$f":"Marketing!B9","v":0}]
["Bull calves",{"$f":"Marketing!B27","v":0},"lb.",{"$f":"Marketing!B29","v":0},"$/lb.",{"$f":"Marketing!B32","v":"0"},{"$f":"Marketing!B31","v":0}]
["Cull cows",{"$f":"Marketing!B37","v":0},"lb.",{"$f":"Marketing!B39","v":0},"$/lb.",{"$f":"Marketing!B42","v":"0"},{"$f":"Marketing!B41","v":0}]
["Other Revnue",null,null,null,null,{"$f":"IF('Breeding Herd'!B4>0,G10/'Breeding Herd'!B4,\"0\")","v":"0"},{"$f":"'Questions for Producers'!B557","v":0}]
["Gross Income",null,null,null,null,{"$f":"SUM(F6:F10)","v":0},{"$f":"SUM(G6:G10)","v":0}]
[]
["Variable Costs",null,null,null,null,"$/cow","$/herd"]
["Bull charge/A.I. Costs",null,null,null,null,{"$f":"'Breeding Herd'!B45","v":"0"},{"$f":"'Breeding Herd'!B44","v":0}]
["Replacement females",null,null,null,null,{"$f":"'Breeding Herd'!B28","v":"0"},{"$f":"'Breeding Herd'!B27","v":0}]
{"$rows_left_out":30}
{"sheet":"Breeding Herd","index":5,"n_rows":49,"n_cols":6,"rows_kept":49,"cut":false,"hidden":false,"merged":[[0,1,0,2]]}
[null,{"$f":"'Questions for Producers'!B4","v":"Oct 1 2017- Sept 30 2018"},null,null,null,"Coming from \"Questions from producers tab\" "]
[null,null,null,null,null,"Formula "]
["Cows"]
["Number of breeding cows",{"$f":"'Questions for Producers'!B8","v":0},{"$f":"'Questions for Producers'!C8","v":"head"}]
["Useful life of cow ",{"$f":"'Questions for Producers'!B9","v":0},{"$f":"'Questions for Producers'!C9","v":"years"}]
["Cow salvage value",{"$f":"Marketing!B40","v":0},"per head"]
["Weaning percentage",{"$f":"IF(B4>0,(Marketing!B4+Marketing!B14+'Breeding Herd'!B19)/'Breeding Herd'!B4,\"0\")","v":"0"}]
["Cow replacement percentage",{"$f":"IF(B4>0,(B11+B19)/'Breeding Herd'!B4,\"0\")","v":"0"}]
[]
["Replacement heifers"]
["Number of purchased replacement heifers",{"$f":"'Questions for Producers'!B15","v":0},{"$f":"'Questions for Producers'!C15","v":"head"}]
["Age of replacement heifers (years)",{"$f":"'Questions for Producers'!B16","v":0},{"$f":"'Questions for Producers'!C16","v":"months"}]
["Weight of replacement heifers (lbs.)",{"$f":"'Questions for Producers'!B17","v":0},{"$f":"'Questions for Producers'!C17","v":"lbs"}]
["Price per cwt of replacement heifers ",{"$f":"'Questions for Producers'!B18","v":0},{"$f":"'Questions for Producers'!C24","v":"per cwt"}]
["Replacement heifer price per head",{"$f":"(B13/100)*B14","v":0}]
{"$rows_left_out":35}
{"sheet":"Marketing","index":6,"n_rows":53,"n_cols":6,"rows_kept":53,"cut":false,"hidden":false,"merged":[[0,1,0,2]]}
[null,{"$f":"'Questions for Producers'!B4","v":"Oct 1 2017- Sept 30 2018"},null,null,null,"Coming from \"Questions from producers tab\" "]
[null,null,null,null,null,"Formula "]
["Steers"]
["Feeder steers sold",{"$f":"'Questions for Producers'!B36","v":0},{"$f":"'Questions for Producers'!C36","v":"head"}]
["Average weight of feeder steer",{"$f":"'Questions for Producers'!B37","v":0},{"$f":"'Questions for Producers'!C37","v":"lbs"}]
["Average price per cwt for feeder steer ",{"$f":"'Questions for Producers'!B39","v":0},{"$f":"'Questions for Producers'!C39","v":"per cwt"}]
["Average price per lb for feeder steer ",{"$f":"B6/100","v":0}]
["Implied feeder steer revenue per head",{"$f":"(B5/100)*B6","v":0}]
["Revenue from feeder steers",{"$f":"B8*B4","v":0}]
["Steer revenue per cow",{"$f":"IF('Breeding Herd'!B$4>0,B9/'Breeding Herd'!B$4,\"0\")","v":"0"}]
[{"$f":"'Questions for Producers'!A38","v":"Average age of feeder steers at sale"},{"$f":"'Questions for Producers'!B38","v":0},{"$f":"'Questions for Producers'!C38","v":"months"}]
[]
["Heifers"]
["Feeder heifers sold",{"$f":"'Questions for Producers'!B42","v":0},{"$f":"'Questions for Producers'!C42","v":"head"}]
["Average weight of feeder heifer",{"$f":"'Questions for Producers'!B43","v":0},{"$f":"'Questions for Producers'!C43","v":"lbs"}]
{"$rows_left_out":39}
{"sheet":"Feed, Hay, Supplements","index":7,"n_rows":101,"n_cols":6,"rows_kept":101,"cut":false,"hidden":false,"merged":[[0,1,0,2]]}
[null,{"$f":"'Questions for Producers'!B4","v":"Oct 1 2017- Sept 30 2018"},null,null,null,"Coming from \"Questions from producers tab\" "]
[null,null,null,null,null,"Formula "]
["FEED"]
["Purchased Feed"]
[{"$f":"'Questions for Producers'!A65","v":"Purchased Feed 1 Description"},{"$f":"'Questions for Producers'!B65","v":0}]
["Amount of Feed purchased",{"$f":"'Questions for Producers'!B67","v":0},{"$f":"'Questions for Producers'!C67","v":" "}]
["Cost per unit of Feed",{"$f":"'Questions for Producers'!B68","v":0},{"$f":"'Questions for Producers'!C68","v":" "}]
["Feed 1 total cost",{"$f":"B6*B7","v":0}]
["Feed 1 total cost per cow",{"$f":"IF('Breeding Herd'!$B$4>0,B8/'Breeding Herd'!$B$4,\"0\")","v":"0"}]
[]
["Feed 2 description",{"$f":"'Questions for Producers'!B72","v":0}]
["Amount of Feed purchased",{"$f":"'Questions for Producers'!B74","v":0},{"$f":"'Questions for Producers'!C74","v":" "}]
["Cost per unit of Feed",{"$f":"'Questions for Producers'!B75","v":0},{"$f":"'Questions for Producers'!C75","v":" "}]
["Feed 2 total cost",{"$f":"B12*B13","v":0}]
["Feed 2 total cost per cow",{"$f":"IF('Breeding Herd'!$B$4>0,B14/'Breeding Herd'!$B$4,\"0\")","v":"0"}]
{"$rows_left_out":87}
{"sheet":"Animal Health","index":8,"n_rows":77,"n_cols":6,"rows_kept":77,"cut":false,"hidden":false,"merged":[[0,1,0,2]]}
[null,{"$f":"'Questions for Producers'!B4","v":"Oct 1 2017- Sept 30 2018"},null,null,null,"Coming from \"Questions from producers tab\" "]
[null,null,null,null,null,"Formula "]
["Vaccination Regime"]
["Vaccine 1 description ",{"$f":"'Questions for Producers'!B155","v":0}]
["Which type of animal is it given too",{"$f":"'Questions for Producers'!B156","v":0}]
["Vaccine 1 units per animal ",{"$f":"'Questions for Producers'!B158","v":0},{"$f":"'Questions for Producers'!C158","v":" "}]
["Vaccine 1 cost per unit",{"$f":"'Questions for Producers'!B159","v":0},{"$f":"'Questions for Producers'!C159","v":" "}]
["Number of animals administered ",{"$f":"'Questions for Producers'!B160","v":0},{"$f":"'Questions for Producers'!C160","v":"head"}]
["Vaccine 1 total cost",{"$f":"B7*B6*B8","v":0}]
[]
["Vaccine 2 description ",{"$f":"'Questions for Producers'!B164","v":0}]
["Which type of animal is it given too",{"$f":"'Questions for Producers'!B165","v":0}]
["Vaccine 2 units per animal ",{"$f":"'Questions for Producers'!B167","v":0},{"$f":"'Questions for Producers'!C167","v":" "}]
["Vaccine 2 cost per unit",{"$f":"'Questions for Producers'!B168","v":0},{"$f":"'Questions for Producers'!C168","v":" "}]
["Number of animals administered ",{"$f":"'Questions for Producers'!B169","v":0},{"$f":"'Questions for Producers'!C169","v":"head"}]
{"$rows_left_out":63}
{"sheet":"Pasture","index":9,"n_rows":90,"n_cols":6,"rows_kept":90,"cut":false,"hidden":false,"merged":[[0,1,0,2]]}
[null,{"$f":"'Questions for Producers'!B4","v":"Oct 1 2017- Sept 30 2018"},null,null,null,"Coming from \"Questions from producers tab\" "]
[null,null,null,null,null,"Formula "]
["Acreage"]
[{"$f":"'Questions for Producers'!A221","v":"Total acres of your farm"},{"$f":"'Questions for Producers'!B221","v":0},{"$f":"'Questions for Producers'!C221","v":"acres"}]
[{"$f":"'Questions for Producers'!A222","v":"Acres dedicated to cow-calf enterprise"},{"$f":"'Questions for Producers'!B222","v":0},{"$f":"'Questions for Producers'!C222","v":"acres"}]
[{"$f":"'Questions for Producers'!A224","v":"Acres rented for cow-calf enterprise"},{"$f":"'Questions for Producers'!B224","v":0},{"$f":"'Questions for Producers'!C224","v":"acres"}]
[{"$f":"'Questions for Producers'!A225","v":"Rental rate per acre per year"},{"$f":"'Questions for Producers'!B225","v":0},{"$f":"'Questions for Producers'!C225","v":"per acre"}]
[{"$f":"'Questions for Producers'!A227","v":"Acres owned for cow-calf enterprise"},{"$f":"'Questions for Producers'!B227","v":0},{"$f":"'Questions for Producers'!C227","v":"acres"}]
["Potential rental rate of owned acres",{"$f":"'Questions for Producers'!B228","v":0},{"$f":"'Questions for Producers'!C228","v":"per acre"}]
["Total acres per cow (stocking rate)",{"$f":"IF('Breeding Herd'!B4>0,B5/'Breeding Herd'!B4,\"0\")","v":"0"}]
["Total acres per breeding animal",{"$f":"IF('Breeding Herd'!B4>0,B5/('Breeding Herd'!B4+'Breeding Herd'!B31),\"0\")","v":"0"}]
[]
["TOTAL LAND COST",{"$f":"SUM((B6*B7),(B8*B9))","v":0}]
["Total land cost per cow",{"$f":"IF('Breeding Herd'!B4>0,B13/'Breeding Herd'!B4,\"0\")","v":"0"}]
[]
{"$rows_left_out":76}
{"sheet":"Labor","index":10,"n_rows":66,"n_cols":6,"rows_kept":66,"cut":false,"hidden":false,"merged":[[0,1,0,2]]}
[null,{"$f":"'Questions for Producers'!B4","v":"Oct 1 2017- Sept 30 2018"},null,null,null,"Coming from \"Questions from producers tab\" "]
[null,null,null,null,null,"Formula "]
[{"$f":"'Questions for Producers'!A492","v":"Primary Operator Labor"}]
[{"$f":"'Questions for Producers'!A493","v":"Hours per week on cow-calf enterprise"},{"$f":"'Questions for Producers'!B493","v":0},{"$f":"'Questions for Producers'!C493","v":"hours per week "}]
[{"$f":"'Questions for Producers'!A494","v":"Work weeks per year"},{"$f":"'Questions for Producers'!B494","v":0},{"$f":"'Questions for Producers'!C494","v":"weeks"}]
[{"$f":"'Questions for Producers'!A495","v":"Value of operator labor"},{"$f":"'Questions for Producers'!B495","v":0},{"$f":"'Questions for Producers'!C495","v":"per hour"}]
["Total hours per year",{"$f":"B4*B5","v":0}]
["Total operator labor hours per cow",{"$f":"IF('Breeding Herd'!$B$4>0,B7/'Breeding Herd'!$B$4,\"0\")","v":"0"}]
["Total primary operator costs",{"$f":"B6*B7","v":0}]
["Total primary operator labor costs per cow",{"$f":"IF('Breeding Herd'!$B$4>0,B9/'Breeding Herd'!$B$4,\"0\")","v":"0"}]
[]
[{"$f":"'Questions for Producers'!A497","v":"Family Labor"}]
[{"$f":"'Questions for Producers'!A498","v":"Family member 1 name"},{"$f":"'Questions for Producers'!B498","v":0}]
[{"$f":"'Questions for Producers'!A499","v":"Hours per week "},{"$f":"'Questions for Producers'!B499","v":0},{"$f":"'Questions for Producers'!C499","v":"hours per week "}]
[{"$f":"'Questions for Producers'!A500","v":"Work weeks per year"},{"$f":"'Questions for Producers'!B500","v":0},{"$f":"'Questions for Producers'!C500","v":"weeks"}]
{"$rows_left_out":52}
{"sheet":"Equipment and Facilities","index":11,"n_rows":220,"n_cols":6,"rows_kept":220,"cut":false,"hidden":false,"merged":[[0,1,0,2]]}
[null,{"$f":"'Questions for Producers'!B4","v":"Oct 1 2017- Sept 30 2018"},null,null,null,"Coming from \"Questions from producers tab\" "]
[null,null,null,null,null,"Formula "]
[{"$f":"'Questions for Producers'!A291","v":"Buildings/Structures/Facilities"}]
[{"$f":"'Questions for Producers'!A292","v":"Buildings/Structures/Facilities 1 description "},{"$f":"'Questions for Producers'!B292","v":0}]
[{"$f":"'Questions for Producers'!A293","v":"Age"},{"$f":"'Questions for Producers'!B293","v":0},{"$f":"'Questions for Producers'!C293","v":"years"}]
[{"$f":"'Questions for Producers'!A294","v":"Useful life"},{"$f":"'Questions for Producers'!B294","v":0},{"$f":"'Questions for Producers'!C294","v":"years"}]
[{"$f":"'Questions for Producers'!A295","v":"Purchase price"},{"$f":"'Questions for Producers'!B295","v":0}]
[{"$f":"'Questions for Producers'!A296","v":"Salvage value at end of useful life"},{"$f":"'Questions for Producers'!B296","v":0}]
[{"$f":"'Questions for Producers'!A297","v":"Percent of use allocated to cow-calf enterprise"},{"$f":"'Questions for Producers'!B297","v":0}]
["Depreciation per year",{"$f":"IF(B6>0,(B7-B8)/B6,\"0\")","v":"0"}]
["Depreciation cost per year allocated to cow-calf enterprise",{"$f":"B9*B10","v":0}]
[]
[{"$f":"'Questions for Producers'!A301","v":"Buildings/Structures/Facilities 2 description "},{"$f":"'Questions for Producers'!B301","v":0}]
[{"$f":"'Questions for Producers'!A302","v":"Age"},{"$f":"'Questions for Producers'!B302","v":0},{"$f":"'Questions for Producers'!C302","v":"years"}]
[{"$f":"'Questions for Producers'!A303","v":"Useful life"},{"$f":"'Questions for Producers'!B303","v":0},{"$f":"'Questions for Producers'!C303","v":"years"}]
{"$rows_left_out":206}
{"sheet":"Fuel and Utilities","index":12,"n_rows":40,"n_cols":6,"rows_kept":40,"cut":false,"hidden":false,"merged":[[0,1,0,2]]}
[null,{"$f":"'Questions for Producers'!B4","v":"Oct 1 2017- Sept 30 2018"},null,null,null,"Coming from \"Questions from producers tab\" "]
[null,null,null,null,null,"Formula "]
[{"$f":"'Questions for Producers'!A462","v":"Fuel "}]
[{"$f":"'Questions for Producers'!A463","v":"Average gas purchased per week"},{"$f":"'Questions for Producers'!B463","v":0},{"$f":"'Questions for Producers'!C463","v":"gallons"}]
[{"$f":"'Questions for Producers'!A464","v":"Average price of gas"},{"$f":"'Questions for Producers'!B464","v":0},{"$f":"'Questions for Producers'!C464","v":"per gallon"}]
["Yearly gas costs",{"$f":"B5*B4*52","v":0}]
[]
[{"$f":"'Questions for Producers'!A465","v":"Average diesel purchased per week"},{"$f":"'Questions for Producers'!B465","v":0},{"$f":"'Questions for Producers'!C465","v":"gallons"}]
[{"$f":"'Questions for Producers'!A466","v":"Average price of diesel"},{"$f":"'Questions for Producers'!B466","v":0},{"$f":"'Questions for Producers'!C466","v":"per gallon"}]
["Yearly diesel costs",{"$f":"B9*B8*52","v":0}]
[]
["TOTAL FUEL COST",{"$f":"SUM(B6,B10)","v":0}]
["Total fuel cost per cow",{"$f":"IF('Breeding Herd'!$B$4>0,B12/'Breeding Herd'!$B$4,\"0\")","v":"0"}]
[]
[{"$f":"'Questions for Producers'!A468","v":"Utilities"}]
{"$rows_left_out":26}
{"sheet":"Operating Loan and Interest","index":13,"n_rows":11,"n_cols":6,"rows_kept":11,"cut":false,"hidden":false,"merged":[[0,1,0,2]]}
[null,{"$f":"'Questions for Producers'!B4","v":"Oct 1 2017- Sept 30 2018"},null,null,null,"Coming from \"Questions from producers tab\" "]
[null,null,null,null,null,"Formula "]
[{"$f":"'Questions for Producers'!A525","v":"Operating Loans"}]
[{"$f":"'Questions for Producers'!A526","v":"Do you have an operating loan? "},{"$f":"'Questions for Producers'!B526","v":0}]
[{"$f":"'Questions for Producers'!A527","v":"Amount financed under your operating loan"},{"$f":"'Questions for Producers'!B527","v":0}]
[{"$f":"'Questions for Producers'!A528","v":"Interest on operating loan"},{"$f":"'Questions for Producers'!B528","v":0}]
[{"$f":"'Questions for Producers'!A529","v":"Duration of operating loan"},{"$f":"'Questions for Producers'!B529","v":0},{"$f":"'Questions for Producers'!C529","v":"months"}]
["Total cost of interest",{"$f":"(B6/12)*B5*B7","v":0},null,null,"Note: simple interest is used"]
[]
["TOTAL OPERATING LOAN COST",{"$f":"B8","v":0}]
["Total operating loan cost per cow",{"$f":"IF('Breeding Herd'!$B$4>0,B10/'Breeding Herd'!$B$4,\"0\")","v":"0"}]

{"sheet":"Taxes","index":14,"n_rows":9,"n_cols":6,"rows_kept":9,"cut":false,"hidden":false,"merged":[[0,1,0,2]]}
[null,{"$f":"'Questions for Producers'!B4","v":"Oct 1 2017- Sept 30 2018"},null,null,null,"Coming from \"Questions from producers tab\" "]
[null,null,null,null,null,"Formula "]
[{"$f":"'Questions for Producers'!A551","v":"Taxes"}]
[{"$f":"'Questions for Producers'!A552","v":"Total property tax"},{"$f":"'Questions for Producers'!B552","v":0}]
[{"$f":"'Questions for Producers'!A553","v":"Percent of property tax allocated to cow-calf enterprise"},{"$f":"'Questions for Producers'!B553","v":0}]
[{"$f":"'Questions for Producers'!A554","v":"Other taxes (not sales tax) associated with cow-calf enterprise"},{"$f":"'Questions for Producers'!B554","v":0}]
[]
["TOTAL TAXES PAID PER YEAR FOR COW-CALF OPERATION",{"$f":"(B4*B5)+B6","v":0}]
["Total taxes paid per year for cow-calf operation per cow",{"$f":"IF('Breeding Herd'!$B$4>0,B8/'Breeding Herd'!$B$4,\"0\")","v":"0"}]

{"sheet":"Insurance","index":15,"n_rows":27,"n_cols":6,"rows_kept":27,"cut":false,"hidden":false,"merged":[[0,1,0,2]]}
[null,{"$f":"'Questions for Producers'!B4","v":"Oct 1 2017- Sept 30 2018"},null,null,null,"Coming from \"Questions from producers tab\" "]
[null,null,null,null,null,"Formula "]
[{"$f":"'Questions for Producers'!A531","v":"Insurance"}]
[{"$f":"'Questions for Producers'!A532","v":"Insurance 1 Description"},{"$f":"'Questions for Producers'!B532","v":0}]
[{"$f":"'Questions for Producers'!A533","v":"Amount of liability covered "},{"$f":"'Questions for Producers'!B533","v":0}]
[{"$f":"'Questions for Producers'!A534","v":"Premium"},{"$f":"'Questions for Producers'!B534","v":0},{"$f":"'Questions for Producers'!C534","v":0}]
[{"$f":"'Questions for Producers'!A535","v":"Allocation to cow-calf enterprise"},{"$f":"'Questions for Producers'!B535","v":0}]
["Number of payments",{"$f":"IF(C6=\"monthly\",12,(IF(C6=\"semiannual\",2,(IF(C6=\"annually\",1,0)))))","v":0}]
["Total annual cost for cow-calf enterprise",{"$f":"B8*B7*B6","v":0}]
[]
[{"$f":"'Questions for Producers'!A539","v":"Insurance 2 Description"},{"$f":"'Questions for Producers'!B539","v":0}]
[{"$f":"'Questions for Producers'!A540","v":"Amount of liability covered "},{"$f":"'Questions for Producers'!B540","v":0}]
[{"$f":"'Questions for Producers'!A541","v":"Premium"},{"$f":"'Questions for Producers'!B541","v":0},{"$f":"'Questions for Producers'!C541","v":0}]
[{"$f":"'Questions for Producers'!A542","v":"Allocation to cow-calf enterprise"},{"$f":"'Questions for Producers'!B542","v":0}]
["Number of payments",{"$f":"IF(C13=\"monthly\",12,(IF(C6=\"semiannual\",2,(IF(C6=\"annually\",1,0)))))","v":0}]
{"$rows_left_out":13}
{"sheet":"Assumptions","index":16,"n_rows":92,"n_cols":9,"rows_kept":92,"cut":false,"hidden":false,"merged":[]}
["Assumed Prices","Price ","Unit","Source",null,null,"Assumed Economic/Useful Life","Years","Source"]
[]
["Land rental rate",35,"acre","AVG amp and non-amp",null,null,"Equipment"]
[null,null,null,null,null,null,"Machinery",10,"Iowa State Extension"]
["Animals",null,null,null,null,null,"Tractors",15,"Iowa State Extension"]
["Average price per cwt for feeder steer ",138.38999999999999,"per cwt","LMIC"]
["Average price per cwt for feeder heifer ",123.49,"per cwt","LMIC",null,null,"Buildings/Structures/Facilities"]
["Average price per cwt for cull cow ",53.2,"per cwt","LMIC",null,null,"Corral - squeeze chute",10,"Iowa State Extension"]
["Price per cwt of replacement heifers ",150,"per cwt","LMIC",null,null,"Fly control facility",10,"Iowa State Extension"]
["Expected price per cwt of replacement heifers ",150,"per cwt","LMIC",null,null,"Barn",20,"Rural Tax Education"]
["Assumed market cost percent",0.02]
["Value of bull ($/head)",6000,"per head"]
["Salvage value of bull ",1311.22,"per head"]
["Beef Check-Off ",1,"per head"]
[]
{"$rows_left_out":77}